Reaction Details
TargetIntegrin alpha-IIb/beta-3
LigandBDBM50006297
Substrate/Competitorn/a
Meas. Tech.ChEMBL_70331 (CHEMBL678836)
IC50 2.7±n/a nM
Citation Barker, PLBullens, SBunting, SBurdick, DJChan, KSDeisher, TEigenbrot, CGadek, TRGantzos, RLipari, MT Cyclic RGD peptide analogues as antiplatelet antithrombotics. J Med Chem35:2040-8 (1992) Integrin alpha-IIb/beta-3
Name:Integrin alpha-IIb/beta-3
Synonyms:Glycoprotein IIb/IIIa
Type:n/a
Mol. Mass.:n/a
Description:ASSAY_ID of EBI is 30109
Components:This complex has 2 components.
Component 1
Name:Integrin beta-3
Type:Protein
Mol. Mass.:87038.91
Organism:Homo sapiens (Human)
Description:P05106
Residue:788
Component 2
Name:Integrin alpha-IIb
Synonyms:CD_antigen=CD41 GPIIb Glycoprotein IIb ITGA2B Integrin alpha-IIb heavy chain Integrin alpha-IIb light chain, form 2 Integrin alpha-V/beta-3 and alpha-IIb/beta 3 | Platelet membrane glycoprotein IIb
Type:Protein
Mol. Mass.:113354.85
Organism:Homo sapiens (Human)
Description:P08514
Residue:1039
BDBM50006297
NameBDBM50006297
Synonyms:15-Carbamoylmethyl-6-carboxymethyl-12-(3-guanidino-propyl)-5,8,11,14,17-pentaoxo-1-thia-4,7,10,13,16-pentaaza-cyclooctadecane-3-carboxylic acid | CHEMBL62989
TypeSmall organic molecule
Emp. Form.C21H33N9O10S
Mol. Mass.603.606
SMILESNC(=O)C[C@@H]1NC(=O)CSC[C@H](NC(=O)[C@H](CC(O)=O)NC(=O)CNC(=O)[C@H](CCCNC(N)=N)NC1=O)C(O)=O