Reaction Details
TargetIntegrin alpha-IIb/beta-3
LigandBDBM50006334
Substrate/Competitorn/a
Meas. Tech.ChEMBL_70331 (CHEMBL678836)
IC50 5.00±n/a nM
Citation Barker, PLBullens, SBunting, SBurdick, DJChan, KSDeisher, TEigenbrot, CGadek, TRGantzos, RLipari, MT Cyclic RGD peptide analogues as antiplatelet antithrombotics. J Med Chem35:2040-8 (1992) Integrin alpha-IIb/beta-3
Name:Integrin alpha-IIb/beta-3
Synonyms:Glycoprotein IIb/IIIa
Type:n/a
Mol. Mass.:n/a
Description:ASSAY_ID of EBI is 30109
Components:This complex has 2 components.
Component 1
Name:Integrin beta-3
Type:Protein
Mol. Mass.:87038.91
Organism:Homo sapiens (Human)
Description:P05106
Residue:788
Component 2
Name:Integrin alpha-IIb
Synonyms:CD_antigen=CD41 GPIIb Glycoprotein IIb ITGA2B Integrin alpha-IIb heavy chain Integrin alpha-IIb light chain, form 2 Integrin alpha-V/beta-3 and alpha-IIb/beta 3 | Platelet membrane glycoprotein IIb
Type:Protein
Mol. Mass.:113354.85
Organism:Homo sapiens (Human)
Description:P08514
Residue:1039
BDBM50006334
NameBDBM50006334
Synonyms:18-Biphenyl-4-yl-6-carboxymethyl-12-(3-guanidino-propyl)-5,8,11,14,17-pentaoxo-1-thia-4,7,10,13,16-pentaaza-cyclooctadecane-3-carboxylic acid | CHEMBL444306
TypeSmall organic molecule
Emp. Form.C31H38N8O9S
Mol. Mass.698.747
SMILESNC(=N)NCCC[C@@H]1NC(=O)CNC(=O)C(SC[C@H](NC(=O)[C@H](CC(O)=O)NC(=O)CNC1=O)C(O)=O)c1ccc(cc1)-c1ccccc1