Reaction Details
TargetSigma non-opioid intracellular receptor 1
LigandBDBM50000769
Substrate/Competitorn/a
Meas. Tech.ChEMBL_226552 (CHEMBL846629)
Ki 0.860000±n/a nM
Citation de Costa, BRadesca, LDominguez, CDi Paolo, LBowen, WD Synthesis and receptor binding properties of fluoro- and iodo-substituted high affinity sigma receptor ligands: identification of potential PET and SPECT sigma receptor imaging agents. J Med Chem35:2221-30 (1992) Sigma non-opioid intracellular receptor 1
Name:Sigma non-opioid intracellular receptor 1
Type:Enzyme Catalytic Domain
Mol. Mass.:25124.85
Organism:Homo sapiens (Human)
Description:Q99720
Residue:223
BDBM50000769
NameBDBM50000769
Synonyms:1-[2-(3,4-Dichloro-phenyl)-ethyl]-4-(5-fluoro-pentyl)-piperazine | CHEMBL312766
TypeSmall organic molecule
Emp. Form.C17H25Cl2FN2
Mol. Mass.347.298
SMILESFCCCCCN1CCN(CCc2ccc(Cl)c(Cl)c2)CC1