Reaction Details
TargetAdenosine receptor A1
LigandBDBM50368341
Substrate/Competitorn/a
Meas. Tech.ChEBML_28837
Ki 136±n/a nM
Citation Abiru, TMiyashita, TWatanabe, YYamaguchi, TMachida, HMatsuda, A Nucleosides and nucleotides. 107. 2-(cycloalkylalkynyl)adenosines: adenosine A2 receptor agonists with potent antihypertensive effects. J Med Chem35:2253-60 (1992) Adenosine receptor A1
Name:Adenosine receptor A1
Type:Protein
Mol. Mass.:36704.13
Organism:Rattus norvegicus (rat)
Description:n/a
Residue:326
BDBM50368341
NameBDBM50368341
Synonyms:CHEMBL610362
TypeSmall organic molecule
Emp. Form.C19H25N5O4
Mol. Mass.387.4329
SMILESNc1nc(nc2n(cnc12)C1O[C@H](CO)[C@@H](O)[C@H]1O)C#CCCC1CCCC1