Reaction Details
Target72 kDa type IV collagenase
LigandBDBM50368352
Substrate/Competitorn/a
Meas. Tech.ChEBML_49492
IC50 1900±n/a nM
Citation Bols, MBinderup, LHansen, JRasmussen, P Inhibition of collagenase by aranciamycin and aranciamycin derivatives. J Med Chem35:2768-71 (1992) 72 kDa type IV collagenase
Name:72 kDa type IV collagenase
Type:Enzyme
Mol. Mass.:73870.36
Organism:Homo sapiens (Human)
Description: P08253
Residue:660
BDBM50368352
NameBDBM50368352
Synonyms:Cerubidine | DAUNORUBICIN
TypeSmall organic molecule
Emp. Form.C27H29NO10
Mol. Mass.527.5199
SMILESCOc1cccc2C(=O)c3c(O)c4C[C@](O)(C[C@H](O[C@H]5C[C@H](N)[C@H](O)[C@H](C)O5)c4c(O)c3C(=O)c12)C(C)=O