Reaction Details
TargetMu-type opioid receptor
LigandBDBM50001021
Substrate/Competitorn/a
Meas. Tech.ChEBML_146540
Ki 9±n/a nM
Citation Carroll, FIAbraham, PParham, KBai, XZhang, XBrine, GAMascarella, SWMartin, BRMay, ELSauss, C Enantiomeric N-substituted N-normetazocines: a comparative study of affinities at sigma, PCP, and mu opioid receptors. J Med Chem35:2812-8 (1992) Mu-type opioid receptor
Name:Mu-type opioid receptor
Type:G Protein-Coupled Receptor (GPCR)
Mol. Mass.:44503.11
Organism:Rattus norvegicus (rat)
Description:Competition binding assays were carried out using membrane preparations from transfected HN9.10 cells that constitutively expressed the mu opioid receptor.
Residue:398
BDBM50001021
NameBDBM50001021
Synonyms:3-But-2-enyl-6,11-dimethyl-1,2,3,4,5,6-hexahydro-2,6-methano-benzo[d]azocin-8-ol | CHEMBL2367798
TypeSmall organic molecule
Emp. Form.C18H25NO
Mol. Mass.271.3972
SMILES[H][C@]12Cc3ccc(O)cc3[C@@](C)(CCN1C\C=C\C)[C@H]2C