Reaction Details
TargetMu-type opioid receptor
LigandBDBM50001052
Substrate/Competitorn/a
Meas. Tech.ChEBML_146540
Ki 20±n/a nM
Citation Carroll, FIAbraham, PParham, KBai, XZhang, XBrine, GAMascarella, SWMartin, BRMay, ELSauss, C Enantiomeric N-substituted N-normetazocines: a comparative study of affinities at sigma, PCP, and mu opioid receptors. J Med Chem35:2812-8 (1992) Mu-type opioid receptor
Name:Mu-type opioid receptor
Type:G Protein-Coupled Receptor (GPCR)
Mol. Mass.:44503.11
Organism:Rattus norvegicus (rat)
Description:Competition binding assays were carried out using membrane preparations from transfected HN9.10 cells that constitutively expressed the mu opioid receptor.
Residue:398
BDBM50001052
NameBDBM50001052
Synonyms:6,11-Dimethyl-3-(3-phenyl-propyl)-1,2,3,4,5,6-hexahydro-2,6-methano-benzo[d]azocin-8-ol; hydrochloride | CHEMBL2368630
TypeSmall organic molecule
Emp. Form.C23H30ClNO
Mol. Mass.371.943
SMILESCl.[H][C@]12Cc3ccc(O)cc3[C@@](C)(CCN1CCCc1ccccc1)[C@H]2C