Reaction Details
TargetAdenosine receptor A2a
LigandBDBM50119168
Substrate/Competitorn/a
Meas. Tech.ChEBML_29154
Ki 2.4±0.3 nM
Citation Homma, HWatanabe, YAbiru, TMurayama, TNomura, YMatsuda, A Nucleosides and nucleotides. 112. 2-(1-Hexyn-1-yl)adenosine-5'-uronamides: a new entry of selective A2 adenosine receptor agonists with potent antihypertensive activity. J Med Chem35:2881-90 (1992) Adenosine receptor A2a
Name:Adenosine receptor A2a
Type:G Protein-Coupled Receptor (GPCR)
Mol. Mass.:45015.65
Organism:Rattus norvegicus (rat)
Description:Rat A2A receptors expressed in CHO cells.
Residue:410
BDBM50119168
NameBDBM50119168
Synonyms:(2R,3R,4S,5R)-2-(6-Amino-2-hex-1-ynyl-purin-9-yl)-5-hydroxymethyl-tetrahydro-furan-3,4-diol (2R,3R,4S,5R)-2-(6-amino-2-(hex-1-ynyl)-9H-purin-9-yl)-5-(hydroxymethyl)tetrahydrofuran-3,4-diol CHEMBL319387
TypeSmall organic molecule
Emp. Form.C16H21N5O4
Mol. Mass.347.369
SMILESCCCCC#Cc1nc(N)c2ncn([C@@H]3O[C@H](CO)[C@@H](O)[C@H]3O)c2n1