Reaction Details
TargetAdenosine receptor A1
LigandBDBM50453216
Substrate/Competitorn/a
Meas. Tech.ChEBML_29154
Ki 117±17 nM
Citation Homma, HWatanabe, YAbiru, TMurayama, TNomura, YMatsuda, A Nucleosides and nucleotides. 112. 2-(1-Hexyn-1-yl)adenosine-5'-uronamides: a new entry of selective A2 adenosine receptor agonists with potent antihypertensive activity. J Med Chem35:2881-90 (1992) Adenosine receptor A1
Name:Adenosine receptor A1
Type:Protein
Mol. Mass.:36704.13
Organism:Rattus norvegicus (rat)
Description:n/a
Residue:326
BDBM50453216
NameBDBM50453216
Synonyms:2-(l-hexyn-l-yl)adenosine (8, YT-146) | CHEMBL2113496
TypeSmall organic molecule
Emp. Form.C18H25N5O4
Mol. Mass.375.4222
SMILESCCCCCCC#Cc1nc(N)c2ncn([C@@H]3O[C@H](CO)[C@@H](O)[C@H]3O)c2n1