Reaction Details
TargetAdenosine receptor A1
LigandBDBM21173
Substrate/Competitorn/a
Meas. Tech.ChEBML_29421
Ki 6.4±n/a nM
Citation Suzuki, FShimada, JMizumoto, HKarasawa, AKubo, KNonaka, HIshii, AKawakita, T Adenosine A1 antagonists. 2. Structure-activity relationships on diuretic activities and protective effects against acute renal failure. J Med Chem35:3066-75 (1992) Adenosine receptor A1
Name:Adenosine receptor A1
Type:Enzyme Catalytic Domain
Mol. Mass.:36501.39
Organism:GUINEA PIG
Description:ADENOSINE A1 ADORA1 GUINEA PIG::P47745
Residue:326
BDBM21173
NameBDBM21173
Synonyms:1,3-dipropyl-8-cyclopentylxanthine CHEMBL183 PD116948 | [3H]DPCPX
Typeradiolabeled ligand
Emp. Form.C16H24N4O2
Mol. Mass.304.3874
SMILESCCCn1c2nc([nH]c2c(=O)n(CCC)c1=O)C1CCCC1