Reaction Details
TargetPolyunsaturated fatty acid 5-lipoxygenase
LigandBDBM50001168
Substrate/Competitorn/a
Meas. Tech.ChEBML_98492
EC50 70±n/a nM
Citation Greco, MNHageman, WEPowell, ETTighe, JJPersico, FJ Benzothiazole hydroxy ureas as inhibitors of 5-lipoxygenase: use of the hydroxyurea moiety as a replacement for hydroxamic acid. J Med Chem35:3180-3 (1992) Polyunsaturated fatty acid 5-lipoxygenase
Name:Polyunsaturated fatty acid 5-lipoxygenase
Type:Enzyme
Mol. Mass.:77972.74
Organism:Homo sapiens (Human)
Description:Recombinant protein was purified from E. coli lysate. After ammonium sulfate precipitation and subsequent steps, the supernatant (S100) was used for 5-LO activity assay.
Residue:674
BDBM50001168
NameBDBM50001168
Synonyms:3-(Benzothiazol-2-ylsulfanyl)-propylamine-N-hydroxy-N-isopropyl carboxamide | CHEMBL108854
TypeSmall organic molecule
Emp. Form.C14H19N3O2S2
Mol. Mass.325.45
SMILESCC(C)N(O)C(=O)NCCCSc1nc2ccccc2s1