Reaction Details
TargetPolyunsaturated fatty acid 5-lipoxygenase
LigandBDBM50001176
Substrate/Competitorn/a
Meas. Tech.ChEBML_98492
EC50 20±n/a nM
Citation Greco, MNHageman, WEPowell, ETTighe, JJPersico, FJ Benzothiazole hydroxy ureas as inhibitors of 5-lipoxygenase: use of the hydroxyurea moiety as a replacement for hydroxamic acid. J Med Chem35:3180-3 (1992) Polyunsaturated fatty acid 5-lipoxygenase
Name:Polyunsaturated fatty acid 5-lipoxygenase
Type:Enzyme
Mol. Mass.:77972.74
Organism:Homo sapiens (Human)
Description:Recombinant protein was purified from E. coli lysate. After ammonium sulfate precipitation and subsequent steps, the supernatant (S100) was used for 5-LO activity assay.
Residue:674
BDBM50001176
NameBDBM50001176
Synonyms:2-(5-Chloro-benzothiazol-2-ylsulfanyl)-ethylamine-N-hydroxy-N-methyl carboxamide | CHEMBL320274
TypeSmall organic molecule
Emp. Form.C11H12ClN3O2S2
Mol. Mass.317.815
SMILESCN(O)C(=O)NCCSc1nc2cc(Cl)ccc2s1