Reaction Details
TargetGag-Pol polyprotein [489-587]
LigandBDBM50230040
Substrate/Competitorn/a
Meas. Tech.ChEBML_157563
Ki 1.7±n/a nM
Citation Rich, DHPrasad, JVSun, CQGreen, JMueller, RHouseman, KMacKenzie, DMalkovsky, M New hydroxyethylamine HIV protease inhibitors that suppress viral replication. J Med Chem35:3803-12 (1992) Gag-Pol polyprotein [489-587]
Name:Gag-Pol polyprotein [489-587]
Type:Enzyme Subunit
Mol. Mass.:10781.16
Organism:Human immunodeficiency virus type 1
Description:P04585[489-587]
Residue:99
BDBM50230040
NameBDBM50230040
Synonyms:CHEMBL3349494
TypeSmall organic molecule
Emp. Form.C43H56N6O9
Mol. Mass.800.9395
SMILES[H][C@@](O)(CN1CCCC1C(=O)N[C@@H]([C@@H](C)CC)C(=O)N[C@@H](Cc1ccccc1)C(=O)OC)[C@H](Cc1ccccc1)NC(=O)[C@H](CC(N)=O)NC(=O)OCc1ccccc1