Reaction Details
TargetGag-Pol polyprotein [489-587]
LigandBDBM50368410
Substrate/Competitorn/a
Meas. Tech.ChEBML_157563
Ki 440±n/a nM
Citation Rich, DHPrasad, JVSun, CQGreen, JMueller, RHouseman, KMacKenzie, DMalkovsky, M New hydroxyethylamine HIV protease inhibitors that suppress viral replication. J Med Chem35:3803-12 (1992) Gag-Pol polyprotein [489-587]
Name:Gag-Pol polyprotein [489-587]
Type:Enzyme Subunit
Mol. Mass.:10781.16
Organism:Human immunodeficiency virus type 1
Description:P04585[489-587]
Residue:99
BDBM50368410
NameBDBM50368410
Synonyms:CHEMBL1790893 | CHEMBL3349503
TypeSmall organic molecule
Emp. Form.C36H58N6O9
Mol. Mass.718.8805
SMILES[H][C@@](O)(CN1CCCC1C(=O)N[C@@H]([C@@H](C)CC)C(=O)N[C@@H](C(C)C)C(=O)OC)[C@H](Cc1ccccc1)NC(=O)[C@H](CC(N)=O)NC(=O)OC(C)(C)C