Reaction Details
TargetGag-Pol polyprotein [489-587]
LigandBDBM50368423
Substrate/Competitorn/a
Meas. Tech.ChEBML_157563
Ki 0.800000±n/a nM
Citation Rich, DHPrasad, JVSun, CQGreen, JMueller, RHouseman, KMacKenzie, DMalkovsky, M New hydroxyethylamine HIV protease inhibitors that suppress viral replication. J Med Chem35:3803-12 (1992) Gag-Pol polyprotein [489-587]
Name:Gag-Pol polyprotein [489-587]
Type:Enzyme Subunit
Mol. Mass.:10781.16
Organism:Human immunodeficiency virus type 1
Description:P04585[489-587]
Residue:99
BDBM50368423
NameBDBM50368423
Synonyms:CHEMBL1790881 | CHEMBL3349492
TypeSmall organic molecule
Emp. Form.C45H56N8O7
Mol. Mass.820.9755
SMILES[H][C@@](O)(CN1CCCC1C(=O)N[C@@H]([C@@H](C)CC)C(=O)N[C@@H](Cc1ccccc1)C(=O)NC)[C@H](Cc1ccccc1)NC(=O)[C@H](CC(N)=O)NC(=O)c1ccc2ccccc2n1