Reaction Details
TargetGag-Pol polyprotein [489-587]
LigandBDBM50368425
Substrate/Competitorn/a
Meas. Tech.ChEBML_157563
Ki 1.3±n/a nM
Citation Rich, DHPrasad, JVSun, CQGreen, JMueller, RHouseman, KMacKenzie, DMalkovsky, M New hydroxyethylamine HIV protease inhibitors that suppress viral replication. J Med Chem35:3803-12 (1992) Gag-Pol polyprotein [489-587]
Name:Gag-Pol polyprotein [489-587]
Type:Enzyme Subunit
Mol. Mass.:10781.16
Organism:Human immunodeficiency virus type 1
Description:P04585[489-587]
Residue:99
BDBM50368425
NameBDBM50368425
Synonyms:CHEMBL1790885 | CHEMBL3349495
TypeSmall organic molecule
Emp. Form.C47H70N8O11
Mol. Mass.923.1057
SMILES[H][C@@](O)(CN1CCCC1C(=O)N[C@@H]([C@@H](C)CC)C(=O)N[C@@H](CCc1ccccc1)C(=O)OC)[C@H](Cc1ccccc1)NC(=O)[C@H](CC(N)=O)NC(=O)[C@H](CC(C)C)NC(=O)[C@H](CO)NC(C)=O