Reaction Details
TargetCarbonic anhydrase 2
LigandBDBM50003246
Substrate/Competitorn/a
Meas. Tech.ChEMBL_45064 (CHEMBL659847)
Ki 2.3±n/a nM
Citation Hartman, GDHalczenko, WSmith, RLSugrue, MFMallorga, PJMichelson, SRRandall, WCSchwam, HSondey, JM 4-substituted thiophene- and furan-2-sulfonamides as topical carbonic anhydrase inhibitors. J Med Chem35:3822-31 (1992) Carbonic anhydrase 2
Name:Carbonic anhydrase 2
Type:Enzyme
Mol. Mass.:29250.71
Organism:Homo sapiens (Human)
Description:P00918
Residue:260
BDBM50003246
NameBDBM50003246
Synonyms:4-(3-Dimethylaminomethyl-4-hydroxy-benzenesulfonyl)-furan-2-sulfonic acid amide; hydrochloride | CHEMBL553909
TypeSmall organic molecule
Emp. Form.C13H16N2O6S2
Mol. Mass.360.406
SMILESCN(C)Cc1cc(ccc1O)S(=O)(=O)c1coc(c1)S(N)(=O)=O