Reaction Details
Target5-hydroxytryptamine receptor 2A/2B/2C
LigandBDBM50002213
Substrate/Competitorn/a
Meas. Tech.ChEBML_2126
Ki 3.6±n/a nM
Citation Gilligan, PJCain, GAChristos, TECook, LDrummond, SJohnson, ALKergaye, AAMcElroy, JFRohrbach, KWSchmidt, WK Novel piperidine sigma receptor ligands as potential antipsychotic drugs. J Med Chem35:4344-61 (1992) 5-hydroxytryptamine receptor 2A/2B/2C
Name:5-hydroxytryptamine receptor 2A/2B/2C
Synonyms:Serotonin 2 (5-HT2) receptor
Type:n/a
Mol. Mass.:n/a
Description:ASSAY_ID of ChEMBL is 2124
Components:This complex has 3 components.
Component 1
Name:5-hydroxytryptamine receptor 2C
Type:Enzyme
Mol. Mass.:51948.16
Organism:Mus musculus (Mouse)
Description:P34968
Residue:459
Component 2
Name:5-hydroxytryptamine receptor 2A
Synonyms:5-HT-2 5-hydroxytryptamine receptor 2A 5HT2A_MOUSE Htr2 Serotonin 2a (5-HT2a) receptor
Type:Enzyme
Mol. Mass.:52843.00
Organism:Mus musculus (Mouse)
Description:P35363
Residue:471
Component 3
Name:5-hydroxytryptamine receptor 2B
Synonyms:5-HT2 5-hydroxytryptamine receptor 2B 5HT2B_MOUSE Htr2b
Type:Enzyme
Mol. Mass.:53610.91
Organism:Mus musculus (Mouse)
Description:Q02152
Residue:479
BDBM50002213
NameBDBM50002213
Synonyms:1-(4-Fluoro-phenyl)-2-{1-[2-(1H-indol-3-yl)-ethyl]-piperidin-4-yl}-ethanone;monohydrate | CHEMBL136064
TypeSmall organic molecule
Emp. Form.C23H25FN2O
Mol. Mass.364.4558
SMILESFc1ccc(cc1)C(=O)CC1CCN(CCc2c[nH]c3ccccc23)CC1