Reaction Details
TargetSigma non-opioid intracellular receptor 1
LigandBDBM50002256
Substrate/Competitorn/a
Meas. Tech.ChEBML_201877
Ki 4±n/a nM
Citation Gilligan, PJCain, GAChristos, TECook, LDrummond, SJohnson, ALKergaye, AAMcElroy, JFRohrbach, KWSchmidt, WK Novel piperidine sigma receptor ligands as potential antipsychotic drugs. J Med Chem35:4344-61 (1992) Sigma non-opioid intracellular receptor 1
Name:Sigma non-opioid intracellular receptor 1
Type:Enzyme Catalytic Domain
Mol. Mass.:25246.51
Organism:Mus musculus (Mouse)
Description:O55242
Residue:223
BDBM50002256
NameBDBM50002256
Synonyms:4-(4-Fluoro-benzyloxymethyl)-1-naphthalen-2-ylmethyl-piperidine; hydrochloride | CHEMBL542740
TypeSmall organic molecule
Emp. Form.C24H26FNO
Mol. Mass.363.4677
SMILESFc1ccc(COCC2CCN(Cc3ccc4ccccc4c3)CC2)cc1