Reaction Details
TargetSigma non-opioid intracellular receptor 1
LigandBDBM50002275
Substrate/Competitorn/a
Meas. Tech.ChEBML_201877
Ki 2±n/a nM
Citation Gilligan, PJCain, GAChristos, TECook, LDrummond, SJohnson, ALKergaye, AAMcElroy, JFRohrbach, KWSchmidt, WK Novel piperidine sigma receptor ligands as potential antipsychotic drugs. J Med Chem35:4344-61 (1992) Sigma non-opioid intracellular receptor 1
Name:Sigma non-opioid intracellular receptor 1
Type:Enzyme Catalytic Domain
Mol. Mass.:25246.51
Organism:Mus musculus (Mouse)
Description:O55242
Residue:223
BDBM50002275
NameBDBM50002275
Synonyms:1-Benzyl-4-(3-phenyl-propoxy)-piperidine; compound with but-2-enedioic acid | CHEMBL136642
TypeSmall organic molecule
Emp. Form.C21H27NO
Mol. Mass.309.4452
SMILESC(COC1CCN(Cc2ccccc2)CC1)Cc1ccccc1