Reaction Details
TargetD(2) dopamine receptor
LigandBDBM50002229
Substrate/Competitorn/a
Meas. Tech.ChEBML_58197
IC50>10000±n/a nM
Citation Gilligan, PJCain, GAChristos, TECook, LDrummond, SJohnson, ALKergaye, AAMcElroy, JFRohrbach, KWSchmidt, WK Novel piperidine sigma receptor ligands as potential antipsychotic drugs. J Med Chem35:4344-61 (1992) D(2) dopamine receptor
Name:D(2) dopamine receptor
Type:Enzyme
Mol. Mass.:50957.64
Organism:Mus musculus (Mouse)
Description:P61168
Residue:444
BDBM50002229
NameBDBM50002229
Synonyms:1-Benzyl-4-cyclohexyloxymethyl-piperidine; hydrochloride | CHEMBL544847
TypeSmall organic molecule
Emp. Form.C19H29NO
Mol. Mass.287.4397
SMILESC(OC1CCCCC1)C1CCN(Cc2ccccc2)CC1