Reaction Details
TargetSigma non-opioid intracellular receptor 1
LigandBDBM50002252
Substrate/Competitorn/a
Meas. Tech.ChEBML_201877
Ki 2±n/a nM
Citation Gilligan, PJCain, GAChristos, TECook, LDrummond, SJohnson, ALKergaye, AAMcElroy, JFRohrbach, KWSchmidt, WK Novel piperidine sigma receptor ligands as potential antipsychotic drugs. J Med Chem35:4344-61 (1992) Sigma non-opioid intracellular receptor 1
Name:Sigma non-opioid intracellular receptor 1
Type:Enzyme Catalytic Domain
Mol. Mass.:25246.51
Organism:Mus musculus (Mouse)
Description:O55242
Residue:223
BDBM50002252
NameBDBM50002252
Synonyms:1-Benzyl-4-(4-fluoro-phenoxymethyl)-piperidine; hydrochloride;0.1hydrate | CHEMBL539358
TypeSmall organic molecule
Emp. Form.C19H22FNO
Mol. Mass.299.3825
SMILESFc1ccc(OCC2CCN(Cc3ccccc3)CC2)cc1