Reaction Details
TargetSigma non-opioid intracellular receptor 1
LigandBDBM50002303
Substrate/Competitorn/a
Meas. Tech.ChEBML_201877
Ki 2±n/a nM
Citation Gilligan, PJCain, GAChristos, TECook, LDrummond, SJohnson, ALKergaye, AAMcElroy, JFRohrbach, KWSchmidt, WK Novel piperidine sigma receptor ligands as potential antipsychotic drugs. J Med Chem35:4344-61 (1992) Sigma non-opioid intracellular receptor 1
Name:Sigma non-opioid intracellular receptor 1
Type:Enzyme Catalytic Domain
Mol. Mass.:25246.51
Organism:Mus musculus (Mouse)
Description:O55242
Residue:223
BDBM50002303
NameBDBM50002303
Synonyms:1-Cyclopropylmethyl-4-(3,4-difluoro-phenoxymethyl)-piperidine; hydrochloride | CHEMBL538532
TypeSmall organic molecule
Emp. Form.C16H21F2NO
Mol. Mass.281.3408
SMILESFc1ccc(OCC2CCN(CC3CC3)CC2)cc1F