Reaction Details
TargetD(1A) dopamine receptor
LigandBDBM50002238
Substrate/Competitorn/a
Meas. Tech.ChEBML_58341
IC50>1000±n/a nM
Citation Yevich, JPNew, JSLobeck, WGDextraze, PBernstein, ETaylor, DPYocca, FDEison, MSTemple, DL Synthesis and biological characterization of alpha-(4-fluorophenyl)-4-(5-fluoro-2-pyrimidinyl)-1-piperazinebutanol and analogues as potential atypical antipsychotic agents. J Med Chem35:4516-25 (1993) D(1A) dopamine receptor
Name:D(1A) dopamine receptor
Type:Enzyme Catalytic Domain
Mol. Mass.:49429.75
Organism:RAT
Description:P18901
Residue:446
BDBM50002238
NameBDBM50002238
Synonyms:(R)1-(4-Fluoro-phenyl)-4-[4-(5-fluoro-pyrimidin-2-yl)-piperazin-1-yl]-butan-1-ol 1-(4-Fluoro-phenyl)-1-[4-(5-fluoro-pyrimidin-2-yl)-piperazin-1-yl]-butan-1-ol(BMY-14802) 1-(4-Fluoro-phenyl)-4-[4-(5-fluoro-pyrimidin-2-yl)-piperazin-1-yl]-butan-1-ol 1-(4-fluorophenyl)-4-(4-(5-fluoropyrimidin-2-yl)piperazin-1-yl)butan-1-ol 4-{4-[5-Fluoro-2-(4-fluoro-phenyl)-2H-pyrimidin-1-yl]-piperazin-1-yl}-butan-1-ol(BMY 14802) CHEMBL60859
TypeSmall organic molecule
Emp. Form.C18H22F2N4O
Mol. Mass.348.3903
SMILESOC(CCCN1CCN(CC1)c1ncc(F)cn1)c1ccc(F)cc1