Reaction Details
TargetDelta-type opioid receptor
LigandBDBM50001714
Substrate/Competitorn/a
Meas. Tech.ChEBML_146877
IC50 0.680000±n/a nM
Citation Klein, PNelson, WL O3-(2-carbomethoxyallyl) ethers of opioid ligands derived from oxymorphone, naltrexone, etorphine, diprenorphine, norbinaltorphimine, and naltrindole. Unexpected O3-dealkylation in the opioid radioligand displacement assay. J Med Chem35:4589-94 (1993) Delta-type opioid receptor
Name:Delta-type opioid receptor
Type:G Protein-Coupled Receptor (GPCR)
Mol. Mass.:40382.98
Organism:Homo sapiens (Human)
Description:Competition binding assays were carried out using membrane preparations from transfected HN9.10 cells that constitutively expressed the delta opioid receptor.
Residue:372
BDBM50001714
NameBDBM50001714
Synonyms:2-[3-cyclopropylmethyl-11-hydroxy-15-methoxy-(1S,2R,6S,14R,15R,16R)-13-oxa-3-azahexacyclo[13.2.2.12,8.01,6.06,14.07,12]icosa-7,9,11-trien-16-yl]-2-propanol 2-[3-cyclopropylmethyl-11-hydroxy-15-methoxy-13-oxa-3-azahexacyclo[13.2.2.12,8.01,6.06,14.07,12]icosa-7(12),8,10-trien-16-yl]-2-propanol DIPRENORPHINE-HCl | Diprenorphine
TypeSmall organic molecule
Emp. Form.C26H35NO4
Mol. Mass.425.5604
SMILESCO[C@]12CC[C@@]3(C[C@@H]1C(C)(C)O)[C@H]1Cc4ccc(O)c5O[C@@H]2[C@]3(CCN1CC1CC1)c45