Reaction Details
TargetMu-type opioid receptor
LigandBDBM50001705
Substrate/Competitorn/a
Meas. Tech.ChEBML_146240
IC50 1.5±n/a nM
Citation Klein, PNelson, WL O3-(2-carbomethoxyallyl) ethers of opioid ligands derived from oxymorphone, naltrexone, etorphine, diprenorphine, norbinaltorphimine, and naltrindole. Unexpected O3-dealkylation in the opioid radioligand displacement assay. J Med Chem35:4589-94 (1993) Mu-type opioid receptor
Name:Mu-type opioid receptor
Type:Enzyme Catalytic Domain
Mol. Mass.:11165.58
Organism:GUINEA PIG
Description:P97266
Residue:98
BDBM50001705
NameBDBM50001705
Synonyms:CHEMBL343167 | methyl 2-[4-cyclopropylmethyl-17-hydroxy-14-oxo-12-oxa-4-azapentacyclo[9.6.1.01,13.05,17.07,18]octadeca-7,9,11(18)-trien-10-yloxymethyl]acrylate
TypeSmall organic molecule
Emp. Form.C25H29NO6
Mol. Mass.439.5009
SMILESCOC(=O)C(=C)COc1ccc2C[C@H]3N(CC4CC4)CC[C@@]45[C@@H](Oc1c24)C(=O)CC[C@@]35O