Reaction Details
TargetDelta-type opioid receptor
LigandBDBM50001703
Substrate/Competitorn/a
Meas. Tech.ChEBML_146877
IC50 0.800000±n/a nM
Citation Klein, PNelson, WL O3-(2-carbomethoxyallyl) ethers of opioid ligands derived from oxymorphone, naltrexone, etorphine, diprenorphine, norbinaltorphimine, and naltrindole. Unexpected O3-dealkylation in the opioid radioligand displacement assay. J Med Chem35:4589-94 (1993) Delta-type opioid receptor
Name:Delta-type opioid receptor
Type:G Protein-Coupled Receptor (GPCR)
Mol. Mass.:40382.98
Organism:Homo sapiens (Human)
Description:Competition binding assays were carried out using membrane preparations from transfected HN9.10 cells that constitutively expressed the delta opioid receptor.
Residue:372
BDBM50001703
NameBDBM50001703
Synonyms:CHEMBL344420 | methyl 2-[22-cyclopropylmethyl-2-hydroxy-14-oxa-11,22-diazaheptacyclo[13.9.1.01,13.02,21.04,12.05,10.019,25]pentacosa-4(12),5(10),6,8,15(25),16,18-heptaen-16-yloxymethyl]acrylate
TypeSmall organic molecule
Emp. Form.C31H32N2O5
Mol. Mass.512.5962
SMILESCOC(=O)C(=C)COc1ccc2C[C@H]3N(CC4CC4)CC[C@@]45[C@@H](Oc1c24)c1[nH]c2ccccc2c1C[C@@]35O