Reaction Details
TargetKappa-type opioid receptor
LigandBDBM50001716
Substrate/Competitorn/a
Meas. Tech.ChEBML_145206
IC50 47±n/a nM
Citation Klein, PNelson, WL O3-(2-carbomethoxyallyl) ethers of opioid ligands derived from oxymorphone, naltrexone, etorphine, diprenorphine, norbinaltorphimine, and naltrindole. Unexpected O3-dealkylation in the opioid radioligand displacement assay. J Med Chem35:4589-94 (1993) Kappa-type opioid receptor
Name:Kappa-type opioid receptor
Type:G Protein-Coupled Receptor (GPCR)
Mol. Mass.:42744.99
Organism:Cavia porcellus (domestic guinea pig)
Description:P41144
Residue:380
BDBM50001716
NameBDBM50001716
Synonyms:CHEMBL140044 | methyl 2-[4-cyclopropylmethyl-14,17-dihydroxy-12-oxa-4-azapentacyclo[9.6.1.01,13.05,17.07,18]octadeca-7,9,11(18)-trien-10-yloxymethyl]acrylate
TypeSmall organic molecule
Emp. Form.C25H31NO6
Mol. Mass.441.5167
SMILESCOC(=O)C(=C)COc1ccc2C[C@H]3N(CC4CC4)CC[C@@]45[C@@H](Oc1c24)[C@H](O)CC[C@@]35O