Reaction Details
TargetDelta-type/Kappa-type/Mu-type opioid receptor
LigandBDBM50123599
Substrate/Competitorn/a
Meas. Tech.ChEBML_145721
IC50 1.7±n/a nM
Citation Klein, PNelson, WL O3-(2-carbomethoxyallyl) ethers of opioid ligands derived from oxymorphone, naltrexone, etorphine, diprenorphine, norbinaltorphimine, and naltrindole. Unexpected O3-dealkylation in the opioid radioligand displacement assay. J Med Chem35:4589-94 (1993) Delta-type/Kappa-type/Mu-type opioid receptor
Name:Delta-type/Kappa-type/Mu-type opioid receptor
Synonyms:Opioid receptors; mu/kappa/delta
Type:n/a
Mol. Mass.:n/a
Description:ASSAY_ID of ChEMBL is 357797
Components:This complex has 3 components.
Component 1
Name:Mu-type opioid receptor
Type:G Protein-Coupled Receptor (GPCR)
Mol. Mass.:44789.51
Organism:Homo sapiens (Human)
Description:P35372
Residue:400
Component 2
Name:Kappa-type opioid receptor
Synonyms:K-OR-1 Kappa-opioid receptor (KOR) Kappa-type opioid receptor (KOR) OPIATE Kappa OPRK1 kappa opioid receptor (KOR)
Type:G Protein-Coupled Receptor (GPCR)
Mol. Mass.:42648.76
Organism:Homo sapiens (Human)
Description:P41145
Residue:380
Component 3
Name:Delta-type opioid receptor
Synonyms:D-OR-1 Delta opioid receptor OPIATE Delta OPRD1 OPRK1 | opioid receptor, delta 1
Type:G Protein-Coupled Receptor (GPCR)
Mol. Mass.:40382.98
Organism:Homo sapiens (Human)
Description:Competition binding assays were carried out using membrane preparations from transfected HN9.10 cells that constitutively expressed the delta opioid receptor.
Residue:372
BDBM50123599
NameBDBM50123599
Synonyms:ETORPHINE
TypeSmall organic molecule
Emp. Form.C25H33NO4
Mol. Mass.411.5338
SMILES[H][C@@]1(C[C@]23C=C[C@]1(OC)[C@@H]1Oc4c5c(C[C@H]2N(C)CC[C@@]315)ccc4O)[C@](C)(O)CCC