Reaction Details
Target5-hydroxytryptamine receptor 3A/3B
LigandBDBM50004275
Substrate/Competitorn/a
Meas. Tech.ChEMBL_2991 (CHEMBL619782)
Ki 4.4±n/a nM
Citation Hayashi, HIchikawa, SKono, MMiwa, YSuzuki, FYoda, N 5-HT3 receptor antagonists. 1. New quinoline derivatives. J Med Chem35:4893-902 (1992) 5-hydroxytryptamine receptor 3A/3B
Name:5-hydroxytryptamine receptor 3A/3B
Type:n/a
Mol. Mass.:n/a
Description:ASSAY_ID of EBI is 2974
Components:This complex has 2 components.
Component 1
Name:5-hydroxytryptamine receptor 3B
Synonyms:5HT3B_RAT Serotonin (5-HT) receptor
Type:PROTEIN
Mol. Mass.:50328.78
Organism:Rattus norvegicus
Description:EBI_11885
Residue:437
Component 2
Name:5-hydroxytryptamine receptor 3A
Synonyms:5-HT3 5HT3A_RAT Htr3 Serotonin (5-HT) receptor | Zacopride site-R
Type:Enzyme Catalytic Domain
Mol. Mass.:55428.70
Organism:RAT
Description:5-HT3 HTR3A RAT::P35563
Residue:483
BDBM50004275
NameBDBM50004275
Synonyms:2-Oxo-1,2-dihydro-quinoline-4-carboxylic acid 8-methyl-8-aza-bicyclo[3.2.1]oct-3-yl ester | CHEMBL148398
TypeSmall organic molecule
Emp. Form.C18H20N2O3
Mol. Mass.312.363
SMILESCN1C2CCC1CC(C2)OC(=O)c1cc(=O)[nH]c2ccccc12