Reaction Details
Target5-hydroxytryptamine receptor 3A/3B
LigandBDBM50004266
Substrate/Competitorn/a
Meas. Tech.ChEMBL_2990 (CHEMBL619781)
Ki 1.3±n/a nM
Citation Hayashi, HIchikawa, SKono, MMiwa, YSuzuki, FYoda, N 5-HT3 receptor antagonists. 1. New quinoline derivatives. J Med Chem35:4893-902 (1992) 5-hydroxytryptamine receptor 3A/3B
Name:5-hydroxytryptamine receptor 3A/3B
Type:n/a
Mol. Mass.:n/a
Description:ASSAY_ID of EBI is 2974
Components:This complex has 2 components.
Component 1
Name:5-hydroxytryptamine receptor 3B
Synonyms:5HT3B_RAT Serotonin (5-HT) receptor
Type:PROTEIN
Mol. Mass.:50328.78
Organism:Rattus norvegicus
Description:EBI_11885
Residue:437
Component 2
Name:5-hydroxytryptamine receptor 3A
Synonyms:5-HT3 5HT3A_RAT Htr3 Serotonin (5-HT) receptor | Zacopride site-R
Type:Enzyme Catalytic Domain
Mol. Mass.:55428.70
Organism:RAT
Description:5-HT3 HTR3A RAT::P35563
Residue:483
BDBM50004266
NameBDBM50004266
Synonyms:1-Benzyl-2-oxo-1,2-dihydro-quinoline-4-carboxylic acid 8-methyl-8-aza-bicyclo[3.2.1]oct-3-yl ester | CHEMBL114444
TypeSmall organic molecule
Emp. Form.C25H26N2O3
Mol. Mass.402.4855
SMILESCN1C2CCC1CC(C2)OC(=O)c1cc(=O)n(Cc2ccccc2)c2ccccc12