Reaction Details
TargetD(2) dopamine receptor
LigandBDBM50001860
Substrate/Competitorn/a
Meas. Tech.ChEMBL_63061 (CHEMBL673628)
Ki 5±n/a nM
Citation Scott, MKMartin, GEDiStefano, DLFedde, CLKukla, MJBarrett, DLBaldy, WJElgin, RJKesslick, JMMathiasen, JR Pyrrole mannich bases as potential antipsychotic agents. J Med Chem35:552-8 (1992) D(2) dopamine receptor
Name:D(2) dopamine receptor
Type:G Protein-Coupled Receptor (GPCR)
Mol. Mass.:50931.60
Organism:Rattus norvegicus (rat)
Description:P61169
Residue:444
BDBM50001860
NameBDBM50001860
Synonyms:1-{5-[4-(2-Methoxy-phenyl)-piperazin-1-ylmethyl]-1-methyl-1H-pyrrol-2-ylmethyl}-azocan-2-one | CHEMBL347056
TypeSmall organic molecule
Emp. Form.C25H36N4O2
Mol. Mass.424.5789
SMILESCOc1ccccc1N1CCN(Cc2ccc(CN3CCCCCCC3=O)n2C)CC1