Reaction Details
Target5-hydroxytryptamine receptor 1A
LigandBDBM50001883
Substrate/Competitorn/a
Meas. Tech.ChEBML_1463
Ki 17±n/a nM
Citation Scott, MKMartin, GEDiStefano, DLFedde, CLKukla, MJBarrett, DLBaldy, WJElgin, RJKesslick, JMMathiasen, JR Pyrrole mannich bases as potential antipsychotic agents. J Med Chem35:552-8 (1992) 5-hydroxytryptamine receptor 1A
Name:5-hydroxytryptamine receptor 1A
Type:G Protein-Coupled Receptor (GPCR)
Mol. Mass.:46445.29
Organism:Rattus norvegicus (rat)
Description:Binding assays were performed using rat hippocampal membranes.
Residue:422
BDBM50001883
NameBDBM50001883
Synonyms:1-{5-[4-(2-Methoxy-phenyl)-piperazin-1-ylmethyl]-1-methyl-1H-pyrrol-2-ylmethyl}-pyrrolidin-2-one | CHEMBL153490
TypeSmall organic molecule
Emp. Form.C22H30N4O2
Mol. Mass.382.4992
SMILESCOc1ccccc1N1CCN(Cc2ccc(CN3CCCC3=O)n2C)CC1