Reaction Details
TargetD(2) dopamine receptor
LigandBDBM50001857
Substrate/Competitorn/a
Meas. Tech.ChEMBL_63061 (CHEMBL673628)
Ki 7±n/a nM
Citation Scott, MKMartin, GEDiStefano, DLFedde, CLKukla, MJBarrett, DLBaldy, WJElgin, RJKesslick, JMMathiasen, JR Pyrrole mannich bases as potential antipsychotic agents. J Med Chem35:552-8 (1992) D(2) dopamine receptor
Name:D(2) dopamine receptor
Type:G Protein-Coupled Receptor (GPCR)
Mol. Mass.:50931.60
Organism:Rattus norvegicus (rat)
Description:P61169
Residue:444
BDBM50001857
NameBDBM50001857
Synonyms:1-{5-[4-(2-Methoxy-phenyl)-piperazin-1-ylmethyl]-1-methyl-1H-pyrrol-2-ylmethyl}-azepan-2-one | CHEMBL152363
TypeSmall organic molecule
Emp. Form.C24H34N4O2
Mol. Mass.410.5524
SMILESCOc1ccccc1N1CCN(Cc2ccc(CN3CCCCCC3=O)n2C)CC1