Reaction Details
TargetD(2) dopamine receptor
LigandBDBM50001878
Substrate/Competitorn/a
Meas. Tech.ChEMBL_63061 (CHEMBL673628)
Ki 13±n/a nM
Citation Scott, MKMartin, GEDiStefano, DLFedde, CLKukla, MJBarrett, DLBaldy, WJElgin, RJKesslick, JMMathiasen, JR Pyrrole mannich bases as potential antipsychotic agents. J Med Chem35:552-8 (1992) D(2) dopamine receptor
Name:D(2) dopamine receptor
Type:G Protein-Coupled Receptor (GPCR)
Mol. Mass.:50931.60
Organism:Rattus norvegicus (rat)
Description:P61169
Residue:444
BDBM50001878
NameBDBM50001878
Synonyms:1-{1-Methyl-5-[4-(2-propyl-phenyl)-piperazin-1-ylmethyl]-1H-pyrrol-2-ylmethyl}-pyrrolidin-2-one | CHEMBL348014
TypeSmall organic molecule
Emp. Form.C24H34N4O
Mol. Mass.394.553
SMILESCCCc1ccccc1N1CCN(Cc2ccc(CN3CCCC3=O)n2C)CC1