Reaction Details
TargetD(2) dopamine receptor
LigandBDBM50001881
Substrate/Competitorn/a
Meas. Tech.ChEMBL_63061 (CHEMBL673628)
Ki 9.5±n/a nM
Citation Scott, MKMartin, GEDiStefano, DLFedde, CLKukla, MJBarrett, DLBaldy, WJElgin, RJKesslick, JMMathiasen, JR Pyrrole mannich bases as potential antipsychotic agents. J Med Chem35:552-8 (1992) D(2) dopamine receptor
Name:D(2) dopamine receptor
Type:G Protein-Coupled Receptor (GPCR)
Mol. Mass.:50931.60
Organism:Rattus norvegicus (rat)
Description:P61169
Residue:444
BDBM50001881
NameBDBM50001881
Synonyms:1-{5-[4-(2-Methoxy-phenyl)-piperazin-1-ylmethyl]-1-methyl-1H-pyrrol-2-ylmethyl}-piperidin-2-one | CHEMBL152776
TypeSmall organic molecule
Emp. Form.C23H32N4O2
Mol. Mass.396.5258
SMILESCOc1ccccc1N1CCN(Cc2ccc(CN3CCCCC3=O)n2C)CC1