Reaction Details
TargetMuscarinic acetylcholine receptor M1
LigandBDBM50005509
Substrate/Competitorn/a
Meas. Tech.ChEMBL_138559 (CHEMBL745515)
IC50 540±n/a nM
Citation Sowell, JWTang, YValli, MJChapman, JMUsher, LAVaughan, CMKosh, JW Synthesis and cholinergic properties of bis[[(dimethylamino)methyl]furanyl] analogues of ranitidine. J Med Chem35:1102-8 (1992) Muscarinic acetylcholine receptor M1
Name:Muscarinic acetylcholine receptor M1
Type:Enzyme Catalytic Domain
Mol. Mass.:51400.50
Organism:Mus musculus
Description:Cholinergic, muscarinic 0 0::Q52KQ0
Residue:460
BDBM50005509
NameBDBM50005509
Synonyms:CHEMBL268499 | {5-[6-(5-Dimethylaminomethyl-furan-2-ylmethylsulfanyl)-hexylsulfanylmethyl]-furan-2-ylmethyl}-dimethyl-amine
TypeSmall organic molecule
Emp. Form.C22H36N2O2S2
Mol. Mass.424.663
SMILESCN(C)Cc1ccc(CSCCCCCCSCc2ccc(CN(C)C)o2)o1