Reaction Details
TargetMuscarinic acetylcholine receptor M1
LigandBDBM50005500
Substrate/Competitorn/a
Meas. Tech.ChEBML_138664
IC50 490±n/a nM
Citation Sowell, JWTang, YValli, MJChapman, JMUsher, LAVaughan, CMKosh, JW Synthesis and cholinergic properties of bis[[(dimethylamino)methyl]furanyl] analogues of ranitidine. J Med Chem35:1102-8 (1992) Muscarinic acetylcholine receptor M1
Name:Muscarinic acetylcholine receptor M1
Type:Enzyme Catalytic Domain
Mol. Mass.:51400.50
Organism:Mus musculus
Description:Cholinergic, muscarinic 0 0::Q52KQ0
Residue:460
BDBM50005500
NameBDBM50005500
Synonyms:CHEMBL13122 | N,N'-Bis-[2-(5-dimethylaminomethyl-furan-2-ylmethylsulfanyl)-ethyl]-4,6-dinitro-benzene-1,3-diamine
TypeSmall organic molecule
Emp. Form.C26H36N6O6S2
Mol. Mass.592.731
SMILESCN(C)Cc1ccc(CSCCNc2cc(NCCSCc3ccc(CN(C)C)o3)c(cc2[N+]([O-])=O)[N+]([O-])=O)o1