Reaction Details
TargetMuscarinic acetylcholine receptor M1
LigandBDBM50005504
Substrate/Competitorn/a
Meas. Tech.ChEBML_138664
IC50 900±n/a nM
Citation Sowell, JWTang, YValli, MJChapman, JMUsher, LAVaughan, CMKosh, JW Synthesis and cholinergic properties of bis[[(dimethylamino)methyl]furanyl] analogues of ranitidine. J Med Chem35:1102-8 (1992) Muscarinic acetylcholine receptor M1
Name:Muscarinic acetylcholine receptor M1
Type:Enzyme Catalytic Domain
Mol. Mass.:51400.50
Organism:Mus musculus
Description:Cholinergic, muscarinic 0 0::Q52KQ0
Residue:460
BDBM50005504
NameBDBM50005504
Synonyms:CHEMBL13206 | N-((5-Ethylsulfanylmethyl-furan-2-ylmethyl)-dimethyl-amine)l-N-[1-(((5-Ethylsulfanylmethyl-furan-2-ylmethyl)-dimethyl-amine)amino)-2-nitrovinyl]amine
TypeSmall organic molecule
Emp. Form.C22H35N5O4S2
Mol. Mass.497.674
SMILESCN(C)Cc1ccc(CSCCNCC(=NCCSCc2ccc(CN(C)C)o2)[N+]([O-])=O)o1