Reaction Details
TargetMuscarinic acetylcholine receptor M2
LigandBDBM50005494
Substrate/Competitorn/a
Meas. Tech.ChEBML_139893
IC50 540±n/a nM
Citation Sowell, JWTang, YValli, MJChapman, JMUsher, LAVaughan, CMKosh, JW Synthesis and cholinergic properties of bis[[(dimethylamino)methyl]furanyl] analogues of ranitidine. J Med Chem35:1102-8 (1992) Muscarinic acetylcholine receptor M2
Name:Muscarinic acetylcholine receptor M2
Type:PROTEIN
Mol. Mass.:51515.43
Organism:Mus musculus
Description:ChEMBL_139897
Residue:466
BDBM50005494
NameBDBM50005494
Synonyms:CHEMBL418714 | {5-[8-(5-Dimethylaminomethyl-furan-2-ylmethylsulfanyl)-octylsulfanylmethyl]-furan-2-ylmethyl}-dimethyl-amine
TypeSmall organic molecule
Emp. Form.C24H40N2O2S2
Mol. Mass.452.717
SMILESCN(C)Cc1ccc(CSCCCCCCCCSCc2ccc(CN(C)C)o2)o1