Reaction Details
TargetCholinesterase
LigandBDBM50005496
Substrate/Competitorn/a
Meas. Tech.ChEBML_41716
IC50 1900±n/a nM
Citation Sowell, JWTang, YValli, MJChapman, JMUsher, LAVaughan, CMKosh, JW Synthesis and cholinergic properties of bis[[(dimethylamino)methyl]furanyl] analogues of ranitidine. J Med Chem35:1102-8 (1992) Cholinesterase
Name:Cholinesterase
Type:Homotetramer
Mol. Mass.:68422.27
Organism:Homo sapiens (Human)
Description:P06276
Residue:602
BDBM50005496
NameBDBM50005496
Synonyms:CHEMBL13426 | {5-[7-(5-Dimethylaminomethyl-furan-2-ylmethylsulfanyl)-heptylsulfanylmethyl]-furan-2-ylmethyl}-dimethyl-amine
TypeSmall organic molecule
Emp. Form.C23H38N2O2S2
Mol. Mass.438.69
SMILESCN(C)Cc1ccc(CSCCCCCCCSCc2ccc(CN(C)C)o2)o1