Reaction Details
TargetAcetylcholinesterase
LigandBDBM50005496
Substrate/Competitorn/a
Meas. Tech.ChEMBL_28634 (CHEMBL644790)
IC50 610±n/a nM
Citation Sowell, JWTang, YValli, MJChapman, JMUsher, LAVaughan, CMKosh, JW Synthesis and cholinergic properties of bis[[(dimethylamino)methyl]furanyl] analogues of ranitidine. J Med Chem35:1102-8 (1992) Acetylcholinesterase
Name:Acetylcholinesterase
Type:Enzyme
Mol. Mass.:67792.70
Organism:Homo sapiens (Human)
Description:P22303
Residue:614
BDBM50005496
NameBDBM50005496
Synonyms:CHEMBL13426 | {5-[7-(5-Dimethylaminomethyl-furan-2-ylmethylsulfanyl)-heptylsulfanylmethyl]-furan-2-ylmethyl}-dimethyl-amine
TypeSmall organic molecule
Emp. Form.C23H38N2O2S2
Mol. Mass.438.69
SMILESCN(C)Cc1ccc(CSCCCCCCCSCc2ccc(CN(C)C)o2)o1