Reaction Details
TargetMuscarinic acetylcholine receptor M2
LigandBDBM50005502
Substrate/Competitorn/a
Meas. Tech.ChEMBL_139893 (CHEMBL744480)
IC50 550±n/a nM
Citation Sowell, JWTang, YValli, MJChapman, JMUsher, LAVaughan, CMKosh, JW Synthesis and cholinergic properties of bis[[(dimethylamino)methyl]furanyl] analogues of ranitidine. J Med Chem35:1102-8 (1992) Muscarinic acetylcholine receptor M2
Name:Muscarinic acetylcholine receptor M2
Type:PROTEIN
Mol. Mass.:51515.43
Organism:Mus musculus
Description:ChEMBL_139897
Residue:466
BDBM50005502
NameBDBM50005502
Synonyms:CHEMBL12472 | {5-[4-(5-Dimethylaminomethyl-furan-2-ylmethylsulfanylmethyl)-benzylsulfanylmethyl]-furan-2-ylmethyl}-dimethyl-amine
TypeSmall organic molecule
Emp. Form.C24H32N2O2S2
Mol. Mass.444.653
SMILESCN(C)Cc1ccc(CSCc2ccc(CSCc3ccc(CN(C)C)o3)cc2)o1