Reaction Details
TargetMuscarinic acetylcholine receptor M2
LigandBDBM50005498
Substrate/Competitorn/a
Meas. Tech.ChEMBL_139893 (CHEMBL744480)
IC50 1600±n/a nM
Citation Sowell, JWTang, YValli, MJChapman, JMUsher, LAVaughan, CMKosh, JW Synthesis and cholinergic properties of bis[[(dimethylamino)methyl]furanyl] analogues of ranitidine. J Med Chem35:1102-8 (1992) Muscarinic acetylcholine receptor M2
Name:Muscarinic acetylcholine receptor M2
Type:PROTEIN
Mol. Mass.:51515.43
Organism:Mus musculus
Description:ChEMBL_139897
Residue:466
BDBM50005498
NameBDBM50005498
Synonyms:CHEMBL12781 | {5-[4'-(5-Dimethylaminomethyl-furan-2-ylmethylsulfanylmethyl)-biphenyl-4-ylmethylsulfanylmethyl]-furan-2-ylmethyl}-dimethyl-amine
TypeSmall organic molecule
Emp. Form.C30H36N2O2S2
Mol. Mass.520.749
SMILESCN(C)Cc1ccc(CSCc2ccc(cc2)-c2ccc(CSCc3ccc(CN(C)C)o3)cc2)o1