Reaction Details
TargetAcetylcholinesterase
LigandBDBM50005761
Substrate/Competitorn/a
Meas. Tech.ChEMBL_28305 (CHEMBL875789)
IC50 58.0±n/a nM
Citation Chen, YLNielsen, JHedberg, KDunaiskis, AJones, SRusso, LJohnson, JIves, JListon, D Syntheses, resolution, and structure-activity relationships of potent acetylcholinesterase inhibitors: 8-carbaphysostigmine analogues. J Med Chem35:1429-34 (1992) Acetylcholinesterase
Name:Acetylcholinesterase
Type:Enzyme
Mol. Mass.:67792.70
Organism:Homo sapiens (Human)
Description:P22303
Residue:614
BDBM50005761
NameBDBM50005761
Synonyms:(+)-Heptyl-carbamic acid 1-ethyl-3a-methyl-1,2,3,3a,8,8a-hexahydro-1-aza-cyclopenta[a]inden-5-yl ester (-)-Heptyl-carbamic acid 1-ethyl-3a-methyl-1,2,3,3a,8,8a-hexahydro-1-aza-cyclopenta[a]inden-5-yl ester | CHEMBL416586
TypeSmall organic molecule
Emp. Form.C22H34N2O2
Mol. Mass.358.5176
SMILESCCCCCCCNC(=O)Oc1ccc2CC3N(CC)CC[C@@]3(C)c2c1