Reaction Details
TargetAcetylcholinesterase
LigandBDBM50005759
Substrate/Competitorn/a
Meas. Tech.ChEBML_28304
IC50 69±n/a nM
Citation Chen, YLNielsen, JHedberg, KDunaiskis, AJones, SRusso, LJohnson, JIves, JListon, D Syntheses, resolution, and structure-activity relationships of potent acetylcholinesterase inhibitors: 8-carbaphysostigmine analogues. J Med Chem35:1429-34 (1992) Acetylcholinesterase
Name:Acetylcholinesterase
Type:Enzyme
Mol. Mass.:67792.70
Organism:Homo sapiens (Human)
Description:P22303
Residue:614
BDBM50005759
NameBDBM50005759
Synonyms:(+/-)-Benzyl-carbamic acid 1-ethyl-3a-methyl-1,2,3,3a,8,8a-hexahydro-1-aza-cyclopenta[a]inden-5-yl ester | CHEMBL286690
TypeSmall organic molecule
Emp. Form.C22H26N2O2
Mol. Mass.350.454
SMILESCCN1CC[C@]2(C)C1Cc1ccc(OC(=O)NCc3ccccc3)cc21