Reaction Details
TargetAcetylcholinesterase
LigandBDBM50005760
Substrate/Competitorn/a
Meas. Tech.ChEMBL_28304 (CHEMBL645003)
IC50 506±n/a nM
Citation Chen, YLNielsen, JHedberg, KDunaiskis, AJones, SRusso, LJohnson, JIves, JListon, D Syntheses, resolution, and structure-activity relationships of potent acetylcholinesterase inhibitors: 8-carbaphysostigmine analogues. J Med Chem35:1429-34 (1992) Acetylcholinesterase
Name:Acetylcholinesterase
Type:Enzyme
Mol. Mass.:67792.70
Organism:Homo sapiens (Human)
Description:P22303
Residue:614
BDBM50005760
NameBDBM50005760
Synonyms:(+/-)-Heptyl-carbamic acid 1-benzyl-3a-methyl-1,2,3,3a,8,8a-hexahydro-1-aza-cyclopenta[a]inden-5-yl ester | CHEMBL288549
TypeSmall organic molecule
Emp. Form.C27H36N2O2
Mol. Mass.420.5869
SMILESCCCCCCCNC(=O)Oc1ccc2CC3N(Cc4ccccc4)CC[C@@]3(C)c2c1