Reaction Details
TargetSerotonin 2 (5-HT2) receptor
LigandBDBM50005836
Substrate/Competitorn/a
Meas. Tech.ChEMBL_2403 (CHEMBL617681)
Ki 6.1±n/a nM
Citation Flynn, DLZabrowski, DLBecker, DPNosal, RVillamil, CIGullikson, GWMoummi, CYang, DC SC-53116: the first selective agonist at the newly identified serotonin 5-HT4 receptor subtype. J Med Chem35:1486-9 (1992) Serotonin 2 (5-HT2) receptor
Name:Serotonin 2 (5-HT2) receptor
Synonyms:5-hydroxytryptamine receptor 2A/2B/2C
Type:n/a
Mol. Mass.:n/a
Description:ASSAY_ID of ChEMBL is 2197419
Components:This complex has 3 components.
Component 1
Name:5-hydroxytryptamine receptor 2B
Type:Enzyme Catalytic Domain
Mol. Mass.:53668.47
Organism:RAT
Description:5-HT2B HTR2B RAT::P30994
Residue:479
Component 2
Name:5-hydroxytryptamine receptor 2C
Synonyms:5-HT2C 5-hydroxytryptamine receptor 2C (5HT2c) 5ht1c Htr2c Serotonin receptor 2a and 2c (5HT2A and 5HT2C)
Type:Enzyme
Mol. Mass.:51935.10
Organism:Rattus norvegicus (Rat)
Description:P08909
Residue:460
Component 3
Name:5-hydroxytryptamine receptor 2A
Synonyms:5-HT-2A 5-HT2A 5-hydroxytryptamine receptor 2A (5HT2A) Htr2 Serotonin Receptor 2A
Type:G Protein-Coupled Receptor (GPCR)
Mol. Mass.:52852.05
Organism:Rattus norvegicus (rat)
Description:Rat cortex membranes 5-HT2A receptors.
Residue:471
BDBM50005836
NameBDBM50005836
Synonyms:4-Amino-5-chloro-N-{1-[3-(4-fluoro-phenoxy)-propyl]-3-methoxy-piperidin-4-yl}-2-methoxy-benzamide CHEMBL560739 PROPULSID US10800776, Example Cisapride cid_5311047
TypeSmall organic molecule
Emp. Form.C23H29ClFN3O4
Mol. Mass.465.945
SMILESCOC1CN(CCCOc2ccc(F)cc2)CCC1NC(=O)c1cc(Cl)c(N)cc1OC