Reaction Details
TargetSerotonin 2 (5-HT2) receptor
LigandBDBM50005833
Substrate/Competitorn/a
Meas. Tech.ChEMBL_2403 (CHEMBL617681)
Ki>10000±n/a nM
Citation Flynn, DLZabrowski, DLBecker, DPNosal, RVillamil, CIGullikson, GWMoummi, CYang, DC SC-53116: the first selective agonist at the newly identified serotonin 5-HT4 receptor subtype. J Med Chem35:1486-9 (1992) Serotonin 2 (5-HT2) receptor
Name:Serotonin 2 (5-HT2) receptor
Synonyms:5-hydroxytryptamine receptor 2A/2B/2C
Type:n/a
Mol. Mass.:n/a
Description:ASSAY_ID of ChEMBL is 2197419
Components:This complex has 3 components.
Component 1
Name:5-hydroxytryptamine receptor 2B
Type:Enzyme Catalytic Domain
Mol. Mass.:53668.47
Organism:RAT
Description:5-HT2B HTR2B RAT::P30994
Residue:479
Component 2
Name:5-hydroxytryptamine receptor 2C
Synonyms:5-HT2C 5-hydroxytryptamine receptor 2C (5HT2c) 5ht1c Htr2c Serotonin receptor 2a and 2c (5HT2A and 5HT2C)
Type:Enzyme
Mol. Mass.:51935.10
Organism:Rattus norvegicus (Rat)
Description:P08909
Residue:460
Component 3
Name:5-hydroxytryptamine receptor 2A
Synonyms:5-HT-2A 5-HT2A 5-hydroxytryptamine receptor 2A (5HT2A) Htr2 Serotonin Receptor 2A
Type:G Protein-Coupled Receptor (GPCR)
Mol. Mass.:52852.05
Organism:Rattus norvegicus (rat)
Description:Rat cortex membranes 5-HT2A receptors.
Residue:471
BDBM50005833
NameBDBM50005833
Synonyms:(exo)4-Amino-5-chloro-N-(hexahydro-pyrrolizin-1-ylmethyl)-2-methoxy-benzamide 4-Amino-5-chloro-N-(hexahydro-pyrrolizin-2-ylmethyl)-2-methoxy-benzamide 4-amino-5-chloro-N-[(1S-cis-hexahydro-1H-pyrrolizin-1-yl)-methyl]-2-methoxybenzenecarboxamide SC-53116 SC53116
TypeSmall organic molecule
Emp. Form.C16H22ClN3O2
Mol. Mass.323.818
SMILESCOc1cc(N)c(Cl)cc1C(=O)NC[C@@H]1CCN2CCC[C@@H]12