Reaction Details
TargetBeta-1/Beta-2/Beta-3 adrenergic receptor
LigandBDBM50005836
Substrate/Competitorn/a
Meas. Tech.ChEMBL_38890 (CHEMBL651237)
Ki>10000±n/a nM
Citation Flynn, DLZabrowski, DLBecker, DPNosal, RVillamil, CIGullikson, GWMoummi, CYang, DC SC-53116: the first selective agonist at the newly identified serotonin 5-HT4 receptor subtype. J Med Chem35:1486-9 (1992) Beta-1/Beta-2/Beta-3 adrenergic receptor
Name:Beta-1/Beta-2/Beta-3 adrenergic receptor
Synonyms:Adrenergic receptor beta
Type:n/a
Mol. Mass.:n/a
Description:ASSAY_ID of ChEMBL is 1340543
Components:This complex has 3 components.
Component 1
Name:Beta-1 adrenergic receptor
Type:Protein
Mol. Mass.:50486.84
Organism:Rattus norvegicus (Rat)
Description:P18090
Residue:466
Component 2
Name:Beta-2 adrenergic receptor
Synonyms:ADRB2_RAT Adrb2r | Adrenergic receptor beta
Type:PROTEIN
Mol. Mass.:46896.26
Organism:Rattus norvegicus
Description:ChEMBL_38603
Residue:418
Component 3
Name:Beta-3 adrenergic receptor
Synonyms:ADRB3_RAT Adrb3r Beta-3 adrenergic receptor
Type:PROTEIN
Mol. Mass.:43161.83
Organism:Rattus norvegicus
Description:ChEMBL_1509452
Residue:400
BDBM50005836
NameBDBM50005836
Synonyms:4-Amino-5-chloro-N-{1-[3-(4-fluoro-phenoxy)-propyl]-3-methoxy-piperidin-4-yl}-2-methoxy-benzamide CHEMBL560739 PROPULSID US10800776, Example Cisapride cid_5311047
TypeSmall organic molecule
Emp. Form.C23H29ClFN3O4
Mol. Mass.465.945
SMILESCOC1CN(CCCOc2ccc(F)cc2)CCC1NC(=O)c1cc(Cl)c(N)cc1OC